{"text_format":"1","workbook":"xlsx","n_sheets":11,"sheets":["初期設定・企業識別子追加","記入例_初期設定・企業識別子追加","ご利用までの流れ","チップ型SIM料金表","カード型SIM料金表","AtMOSInput(ReadOnly)","AtMOSInputUnitPrice(ReadOnly)","リスト","ご提供条件説明","通信機器売買契約条項","Validation"],"not_rendered":{"charts":0,"images":5,"macros":1,"external_links":4,"defined_names":9,"comments":1,"pivot_tables":0},"unopened":[],"bounds":{"document_bytes":16777216,"sheet_cells":100000,"rows_first":2000,"rows_last":500,"rows_between":2000,"halvings":0,"cell_chars":16384,"cell_head_chars":4096},"cells_cut":0,"cells_raw":0,"read":"whole","date_system":"1900"}

{"sheet":"初期設定・企業識別子追加","index":0,"n_rows":93,"n_cols":41,"rows_kept":93,"cut":false,"hidden":false,"merged":[[86,24,86,44],[86,1,86,23],[91,1,91,8],[91,9,91,20],[85,16,85,44],[85,9,85,15],[87,1,87,8],[88,1,88,8],[89,1,89,8],[89,9,89,20],[88,9,88,20],[87,9,87,20],[90,1,90,8],[79,20,79,35],[84,9,84,15],[84,16,84,20],[79,14,79,19],[82,14,82,21],[61,11,61,15],[61,17,61,21],[54,17,54,21],[56,29,56,31],[64,9,64,44],[77,25,77,27],[72,15,72,22],[68,15,68,22],[68,24,68,36],[63,26,63,32],[76,10,76,44],[9,37,9,38],[9,39,9,40],[9,35,9,36],[29,19,29,20],[21,10,21,25],[21,27,21,43],[28,10,28,44],[29,21,29,22],[29,17,29,18],[29,23,29,24],[9,43,9,44],[9,41,9,42],[15,10,15,30],[13,11,13,18],[29,25,29,26],[24,10,24,30],[6,2,6,23],[7,2,7,23],[8,2,8,23],[44,10,44,19],[49,11,49,15],[49,17,49,21],[25,10,25,44],[27,10,27,23],[27,25,27,38],[32,30,32,35],[32,25,32,28],[9,14,9,15],[9,18,9,19],[9,22,9,23],[29,15,29,16],[11,11,11,15],[1,1,1,44],[2,1,2,44],[3,1,3,44],[4,1,4,44],[5,1,5,44],[9,27,9,31],[17,9,22,9],[9,32,9,34],[9,9,9,11],[9,12,9,13],[92,1,92,8],[92,9,92,20],[92,21,92,44],[11,17,11,21],[18,10,18,30],[36,25,36,27],[40,11,40,13],[40,15,40,17],[40,19,40,21],[36,18,36,20],[36,11,36,13],[54,11,54,15],[63,14,63,20],[56,21,56,27],[57,21,57,27],[77,22,77,24]]}
[]
[null,"Master'sONEモバイルスタンダードタイプ申込書 ver2.1"]
[]
[null,"初期設定シート／企業識別子追加シート"]
[]
[]
[null,null,"株式会社NTT PC コミュニケーションズ　御中"]
[null,null,"Master'sONE利用規約を承諾の上、下記の通り申し込みます。"]
[null,null,"＜太枠の中をご記入願います。また該当する個所の□を塗りつぶして下さい。＞"]
[null,null,null,null,null,null,null,null,null,"お申込日",null,null,20,null,null,null,"年",null,null,null,"月",null,null,null,"日",null,null,"システム番号",null,null,null,null,"選択式"]
[null,null,null,null,null,null,null,null,null,"申込区分"]
[null,null,null,null,null,null,null,null,null,null,"■","新規申し込み",null,null,null,null,"□","企業識別子追加"]
[null,null,null,null,null,null,null,null,null,"IDタイプ"]
[null,null,null,null,null,null,null,null,null,null,"□","共通ID/固定パスワード",null,null,null,null,null,null,null,"□","ユニークID/固定パスワード",null,null,null,null,null,null,null,null,null,null,"□","共通ID/固定パスワード（チップSIM）"]
[null,null,null,null,null,null,null,null,null,"会社名"]
[]
[]
[null,null,null,null,null,null,null,null,null,"システム管理者情報","担当者名"]
[]
[]
[null,null,null,null,null,null,null,null,null,null,"電話番号",null,null,null,null,null,null,null,null,null,null,null,null,null,null,null,null,"メールアドレス"]
[]
[]
[null,null,null,null,null,null,null,null,null,"システム名"]
[]
[null,null,null,null,null,null,null,null,null,null,"お客様のネットワークを表す名称です。システム番号を発行する際に指定したシステム名をご記入ください。(全角のみ)"]
[null,null,null,null,null,null,null,null,null,"企業識別子"]
[null,null,null,null,null,null,null,null,null,null,null,null,null,null,null,null,null,null,null,null,null,null,null,null,null,"ご指定の企業識別子の場合、ユーザIDに使える文字数は",null,null,null,null,null,null,null,null,null,null,null,null,null,{"$f":"16-VALUE(LEN(K28))","v":16},"文字です"]
[null,null,null,null,null,null,null,null,null,null,"※文字数は2～13文字の範囲でご記入ください。\n※利用可能な文字は「半角の英数字（大文字・小文字の区別あり）」、「-(ハイフン)」、「_(アンダースコア)」です。ただし数字のみ又は記号のみの指定はできません。\n※ご指定の企業識別子が他のお客様と重複する場合は、他の識別子への変更をお願いさせていただくことがあります。\n※ユーザIDは3～14 文字の範囲でカスタマコンソールより指定できます。"]
[null,null,null,null,null,null,null,null,null,"設定完了希望日",null,null,null,null,20,null,null,"年",null,null,null,"月",null,null,null,"日",null,"SIMおよび端末のお申込みは設定完了希望日以降に行えます。"]
{"$rows_left_out":64}
{"sheet":"記入例_初期設定・企業識別子追加","index":1,"n_rows":93,"n_cols":44,"rows_kept":93,"cut":false,"hidden":false,"merged":[[90,1,90,8],[92,1,92,8],[92,9,92,20],[92,21,92,44],[91,1,91,8],[91,9,91,20],[89,1,89,8],[89,9,89,20],[79,14,79,19],[79,20,79,35],[82,14,82,21],[84,9,84,15],[84,16,84,20],[85,9,85,15],[85,16,85,44],[86,1,86,44],[87,1,87,8],[87,9,87,20],[88,1,88,8],[88,9,88,20],[72,15,72,22],[77,22,77,24],[77,25,77,27],[49,11,49,15],[49,17,49,21],[57,21,57,27],[76,10,76,44],[61,17,61,21],[63,14,63,20],[63,26,63,32],[68,15,68,22],[68,24,68,36],[61,11,61,15],[54,11,54,15],[54,17,54,21],[56,21,56,27],[36,11,36,13],[36,18,36,20],[36,25,36,27],[29,23,29,24],[32,25,32,28],[29,15,29,16],[29,17,29,18],[29,19,29,20],[29,21,29,22],[56,29,56,31],[57,29,57,31],[40,11,40,13],[40,15,40,17],[40,19,40,21],[44,10,44,19],[32,30,32,35],[27,25,27,38],[28,10,28,44],[29,25,29,26],[27,10,27,23],[24,10,24,30],[9,27,9,31],[9,32,9,34],[9,35,9,36],[9,37,9,38],[15,10,15,30],[13,11,13,18],[9,9,9,11],[9,14,9,15],[1,1,1,44],[2,1,2,44],[3,1,3,44],[4,1,4,44],[5,1,5,44],[6,2,6,23],[7,2,7,23],[8,2,8,23],[9,41,9,42],[25,10,25,44],[18,10,18,30],[21,10,21,25],[21,27,21,43],[17,9,22,9],[9,12,9,13],[9,18,9,19],[9,22,9,23],[9,39,9,40],[9,43,9,44],[11,11,11,15],[11,17,11,21]]}
[]
[null,"Master'sONEモバイルスタンダードタイプ申込書"]
[]
[null,"初期設定シート／企業識別子追加シート"]
[]
[]
[null,null,"株式会社NTT PC コミュニケーションズ　御中"]
[null,null,"Master'sONE利用規約を承諾の上、下記の通り申し込みます。"]
[null,null,"＜太枠の中をご記入願います。また該当する個所の□を塗りつぶして下さい。＞"]
[null,null,null,null,null,null,null,null,"記入してください","お申込日",null,null,20,null,null,null,"年",null,9,null,"月",null,4,null,"日",null,null,"システム番号",null,null,null,null,"one",null,null,0,null,1,null,2,null,3,null,4]
[null,null,null,null,null,null,null,null,null,"申込区分"]
[null,null,null,null,null,null,null,null,null,null,"■","新規申し込み",null,null,null,null,"□","企業識別子追加"]
[null,null,null,null,null,null,null,null,null,"IDタイプ"]
[null,null,null,null,null,null,null,null,null,null,"□","共通ID/固定パスワード",null,null,null,null,null,null,null,"□","ユニークID/固定パスワード"]
[null,null,null,null,null,null,null,null,null,"会社名"]
[null,null,null,null,null,null,null,null,null,null,"株式会社エヌ・ティ・ティピー・シーコミュニケーションズ"]
[]
[null,null,null,null,null,null,null,null,null,"システム管理者情報","担当者名"]
[null,null,null,null,null,null,null,null,null,null,"PC次郎"]
[]
[null,null,null,null,null,null,null,null,null,null,"電話番号",null,null,null,null,null,null,null,null,null,null,null,null,null,null,null,null,"メールアドレス"]
[null,null,null,null,null,null,null,null,null,null,"00-0000-0000",null,null,null,null,null,null,null,null,null,null,null,null,null,null,null,null,"pctaro@nttpc.co.jp"]
[]
[null,null,null,null,null,null,null,null,null,"システム名"]
[null,null,null,null,null,null,null,null,null,null,"ＮＴＴＰＣ＿Ｍ２Ｍネットワーク"]
[null,null,null,null,null,null,null,null,null,null,"お客様のネットワークを表す名称です。システム番号を発行する際に指定したシステム名をご記入ください。(全角のみ)"]
[null,null,null,null,null,null,null,null,null,"企業識別子"]
[null,null,null,null,null,null,null,null,null,null,"nttpc-m2m",null,null,null,null,null,null,null,null,null,null,null,null,null,null,"ご指定の企業識別子の場合、ユーザIDに使える文字数は",null,null,null,null,null,null,null,null,null,null,null,null,null,{"$f":"16-VALUE(LEN(K28))","v":7},"文字です"]
[null,null,null,null,null,null,null,null,null,null,"※文字数は2～13文字の範囲でご記入ください。\n※利用可能な文字は「半角の英数字（大文字・小文字の区別あり）」、「-(ハイフン)」、「_(アンダースコア)」です。ただし数字のみ又は記号のみの指定はできません。\n※ご指定の企業識別子が他のお客様と重複する場合は、他の識別子への変更をお願いさせていただくことがあります。\n※ユーザIDは3～14 文字の範囲でカスタマコンソールより指定できます。"]
[null,null,null,null,null,null,null,null,null,"設定完了希望日",null,null,null,null,20,18,null,"年",null,9,null,"月",null,28,null,"日",null,"SIMおよび端末のお申込みは設定完了希望日以降に行えます。"]
{"$rows_left_out":64}
{"sheet":"ご利用までの流れ","index":2,"n_rows":0,"n_cols":0,"rows_kept":0,"cut":false,"hidden":false,"merged":[]}

{"sheet":"チップ型SIM料金表","index":3,"n_rows":52,"n_cols":5,"rows_kept":52,"cut":false,"hidden":true,"merged":[[45,3,46,3]]}
["料金表"]
[]
["Master'sONEモバイルスタンダードタイプ(旧称：モバイルM2M VPNタイプ)のお申込みにあたり、弊社が提供する"]
["カスタマーコンソールから利用開始登録をされたチップSIMは下記に定める提供料金が適用されます。"]
[]
["下記料金表は消費税及び地方消費税相当額を含まない金額を表示します。"]
[]
["■Master'sONEモバイルスタンダードタイプ(旧称：モバイルM2M VPNタイプ) 基本サービス月額料金（1回線毎)"]
["プラン","金額","金額(税込)","対応回線"]
["標準プラン",700,{"$f":"B10*1.1","v":770.00000000000011},"3G/LTE"]
["ライトプラン",280,{"$f":"B11*1.1","v":308},"3G/LTE"]
["従量プラン",280,308,"3G/LTE"]
["1GBプラン",720,792.00000000000011,"3G/LTE"]
["3GBプラン",1980,2178,"3G/LTE"]
["5GBプラン",2980,3278.0000000000005,"LTE"]
["10GBプラン",5480,6028.0000000000009,"LTE"]
["20GBプラン",7980,8778,"LTE"]
["30GBプラン",9980,10978,"LTE"]
["50GBプラン",12980,14278.000000000002,"LTE"]
["上り1GBプラン",420,462.00000000000006,"3G/LTE"]
["上り3GBプラン",680,748.00000000000011,"3G/LTE"]
["上り5GBプラン",920,1012.0000000000001,"LTE"]
["上り10GBプラン",1480,1628.0000000000002,"LTE"]
["上り30GBプラン",1980,2178,"LTE"]
["上り50GBプラン",2880,3168.0000000000005,"LTE"]
["上り100GBプラン",5920,6512.0000000000009,"LTE"]
["上り200GBプラン",9980,10978,"LTE"]
["休止プラン",150,165,"LTE"]
[]
["■Master'sONEモバイルスタンダードタイプ(旧称：モバイルM2M VPNタイプ) 基本サービス初期料金"]
{"$rows_left_out":23}
{"sheet":"カード型SIM料金表","index":4,"n_rows":96,"n_cols":3,"rows_kept":96,"cut":false,"hidden":true,"merged":[[48,2,49,2],[92,0,95,0],[53,0,54,0],[69,0,70,0],[71,0,76,0],[79,0,82,0],[83,0,86,0],[89,0,89,5]]}
["料金表"]
[]
["Master'sONEモバイルスタンダードタイプ(旧称：モバイルM2M VPNタイプ)のお申込みにあたり、弊社が提供する"]
["カスタマーコンソールから発注されたSIMおよび端末は基本設定シートに記載された見積番号/契約番号で定める提供料金が適用されます。"]
["当該見積書/契約書等に記載のない項目については、利用規約および下記に規定する料金が適用されます。"]
[]
["以下、利用規約に定める料金を抜粋します。利用規約と以下記載の料金に齟齬がある場合は利用規約で定める料金が適用されます。"]
["Master'sONE利用規約：https://www.nttpc.co.jp/support/term/mastersone.html"]
[]
["下記料金表は消費税及び地方消費税相当額を含まない金額を表示します。"]
[]
["■Master'sONEモバイルスタンダードタイプ(旧称：モバイルM2M VPNタイプ) 基本サービス月額料金（1回線毎)"]
["プラン","金額(税抜)","対応回線"]
["標準プラン","700円(税込770円)","3G/LTE"]
["ライトプラン","280円(税込308円)","3G/LTE"]
["従量プラン","280円(税込308円)","3G/LTE"]
["1GBプラン","720円(税込792円)","3G/LTE"]
["3GBプラン","1,980円(税込2,178円)","3G/LTE"]
["5GBプラン","2,980円(税込3,278円)","LTE"]
["10GBプラン","5,480円(税込6,028円)","LTE"]
["20GBプラン","7,980円(税込8,778円)","LTE"]
["30GBプラン","9,980円(税込10,978円)","LTE"]
["50GBプラン","12,980円(税込14,278円)","LTE"]
["上り1GBプラン","420円(税込462円)","3G/LTE"]
["上り3GBプラン","680円(税込748円)","3G/LTE"]
["上り5GBプラン","920円(税込1,012円)","LTE"]
["上り10GBプラン","1,480円(税込1,628円)","LTE"]
["上り30GBプラン","1,980円(税込2,178円)","LTE"]
["上り50GBプラン","2,880円(税込3,168円)","LTE"]
["上り100GBプラン","5,920円(税込6,512円)","LTE"]
{"$rows_left_out":67}
{"sheet":"AtMOSInput(ReadOnly)","index":5,"n_rows":51,"n_cols":4,"rows_kept":51,"cut":false,"hidden":true,"merged":[]}
["AtMOS項目名","AtMOS入力値","型","AtMOSコード"]
["申込日",{"$f":"IF(AND(初期設定・企業識別子追加!O10=\"\",初期設定・企業識別子追加!S10=\"\",初期設定・企業識別子追加!W10=\"\"),\"\",初期設定・企業識別子追加!M10&初期設定・企業識別子追加!O10&\"/\"&初期設定・企業識別子追加!S10&\"/\"&初期設定・企業識別子追加!W10)","v":""},"日付"]
["システム番号",{"$f":"初期設定・企業識別子追加!AG10 & 初期設定・企業識別子追加!AJ10 & 初期設定・企業識別子追加!AL10 & 初期設定・企業識別子追加!AN10 & 初期設定・企業識別子追加!AP10 & 初期設定・企業識別子追加!AR10","v":"選択式"},"文字列"]
["システム名",{"$f":"IF(初期設定・企業識別子追加!K25=\"\",\"\",初期設定・企業識別子追加!K25)","v":""},"文字列"]
["ネットワーク種別",{"$f":"IF(ISERROR(FIND(\"InfoSphere\",初期設定・企業識別子追加!B2)),1,2)","v":1},"コード：ネットワーク種別","1:VPNタイプ\n2:インターネットタイプ"]
["端末IPアドレス帯",{"$f":"IF(初期設定・企業識別子追加!K41=\"■\",\"3\",IF(初期設定・企業識別子追加!O41=\"■\",\"4\",IF(初期設定・企業識別子追加!S41=\"■\",\"2\",\"\")))","v":""},"コード：クラス","1:グローバルアドレス\n2:シェアードアドレス\n3:プライベートアドレス(クラスA)\n4:プライベートアドレス(クラスB)\n5:標準サービス（プライベートIP固定）"]
["サフィックス",{"$f":"B8&\".\" & B9& \".\" &B10","v":"..msone.jp"},"文字列"]
["【サフィックス】企業識別子",{"$f":"IF(初期設定・企業識別子追加!K28=\"\",\"\",初期設定・企業識別子追加!K28)","v":""},"文字列"]
["【サフィックス】サービス識別子",{"$f":"IF(AND(B12=1,B11=2),\"vc3\",IF(AND(B12=2,B11=2),\"vct\",IF(AND(B12=1,B11=1),\"vu3\",IF(AND(B12=2,B11=1),\"vut\",IF(AND(B12=5,B11=2),\"cva\",\"\")))))","v":""},"文字列"]
["【サフィックス】ドメイン","msone.jp","文字列"]
["認証方式",{"$f":"IF(AND(初期設定・企業識別子追加!K14=\"□\",初期設定・企業識別子追加!T14=\"□\",初期設定・企業識別子追加!AF14=\"□\"),\"\",IF(初期設定・企業識別子追加!T14=\"■\",1,2))","v":""},"コード：アカウントタイプ","1:ユニークID\n2:共通ID"]
["【通信方式】通信規格",{"$f":"IF(OR(初期設定・企業識別子追加!K37=\"■\",初期設定・企業識別子追加!R37=\"■\"),1,IF(AND(初期設定・企業識別子追加!Y37=\"■\",OR(初期設定・企業識別子追加!K14=\"■\",初期設定・企業識別子追加!T14=\"■\")),2,IF(AND(初期設定・企業識別子追加!Y37=\"■\",初期設定・企業識別子追加!AF14=\"■\"),5,\"\")))","v":""},"コード：通信規格","1:3G\n2:LTE\n3:バックアップ\n4:マルチキャリア\n5:チップSIMスタンダード\n6:チップSIMマルチキャリア"]
["【通信方式】PDPタイプ",{"$f":"IF(OR(初期設定・企業識別子追加!R37=\"■\",初期設定・企業識別子追加!Y37=\"■\"),2,IF(初期設定・企業識別子追加!K37=\"■\",1,\"\"))","v":2},"コード：PDPタイプ","1:PPP\n2:IP"]
["IPアドレス数",{"$f":"IFERROR(MID(初期設定・企業識別子追加!K45,FIND(\"/\",初期設定・企業識別子追加!K45),3),\"\")","v":""},"文字列"]
["【NAT機能】NAT機能有無",{"$f":"IF(初期設定・企業識別子追加!Q55=\"■\",1,IF(初期設定・企業識別子追加!K55=\"■\",0,\"\"))","v":""},"コード：NAT利用","0:利用しない\n1:利用する"]
["【NAT機能】NAT後アドレス帯",{"$f":"IF(初期設定・企業識別子追加!V57=\"\",\"\",初期設定・企業識別子追加!V57)","v":""},"文字列"]
["【NAT機能】NAT後IPアドレス数",{"$f":"IF(初期設定・企業識別子追加!AD57=\"\",\"\",\"/\" & 初期設定・企業識別子追加!AD57)","v":""},"文字列"]
["【NAT機能】NAT後試験アドレス",{"$f":"IF(初期設定・企業識別子追加!V58=\"\",\"\",初期設定・企業識別子追加!V58)","v":""},"文字列"]
["折り返し通信禁止",{"$f":"IF(初期設定・企業識別子追加!K50=\"■\",0,IF(初期設定・企業識別子追加!Q50=\"■\",1,\"\"))","v":""},"コード：折り返し通信禁止有無","0:利用しない\n1:利用する"]
["【SIM管理API】SIM管理API有無",{"$f":"IF(初期設定・企業識別子追加!K12=\"■\",0,\"\")","v":0},"コード：SIM管理API利用","0:利用しない\n1:利用する"]
["【SIM管理API】ユーザID",{"$f":"IF(初期設定・企業識別子追加!O80=\"\",\"\",初期設定・企業識別子追加!O80)","v":""},"文字列"]
["【SIM管理API】パスワード",{"$f":"IF(初期設定・企業識別子追加!O83=\"\",\"\",初期設定・企業識別子追加!O83)","v":""},"文字列"]
["【DNSアドレス付与】DNSアドレス付与有無",{"$f":"IF(初期設定・企業識別子追加!K62=\"■\",0,IF(初期設定・企業識別子追加!Q62=\"■\",1,\"\"))","v":""},"コード：DNSアドレス付与","0:利用しない\n1:利用する"]
["【DNSアドレス付与】プライマリDNS",{"$f":"IF(初期設定・企業識別子追加!O64=\"\",\"\",初期設定・企業識別子追加!O64)","v":""},"文字列"]
["【DNSアドレス付与】セカンダリDNS",{"$f":"IF(初期設定・企業識別子追加!AA64=\"\",\"\",初期設定・企業識別子追加!AA64)","v":""},"文字列"]
["【カスタマコントロール利用管理者】ユーザID",{"$f":"IF(初期設定・企業識別子追加!P69=\"\",\"\",初期設定・企業識別子追加!P69&初期設定・企業識別子追加!X69&初期設定・企業識別子追加!Y69)","v":""},"文字列"]
["【カスタマコントロール利用管理者】パスワード",{"$f":"IF(初期設定・企業識別子追加!P73=\"\",\"\",初期設定・企業識別子追加!P73)","v":""},"文字列"]
["最低利用期間",{"$f":"IF(初期設定・企業識別子追加!J88=\"\",\"\",初期設定・企業識別子追加!J88)","v":0},"数値（月数）"]
["利用開始希望日",{"$f":"IF(AND(初期設定・企業識別子追加!P30=\"\",  初期設定・企業識別子追加!T30=\"\", 初期設定・企業識別子追加!X30=\"\"),\"\",  初期設定・企業識別子追加!O30 &初期設定・企業識別子追加!P30& \"/\" & 初期設定・企業識別子追加!T30 & \"/\" & 初期設定・企業識別子追加!X30)","v":""},"日付"]
["契約番号",{"$f":"IF(初期設定・企業識別子追加!J90=\"\",\"\",初期設定・企業識別子追加!J90)","v":""},"文字列"]
{"$rows_left_out":22}
{"sheet":"AtMOSInputUnitPrice(ReadOnly)","index":6,"n_rows":304,"n_cols":8,"rows_kept":304,"cut":false,"hidden":true,"merged":[]}
["適用開始年月","明細内訳コード","型番","端末機種コード","金額","請求明細名","端末名称（レンタル・物販の場合）","備考"]
[null,"P00001445","UX302NC",null,0,"端末初期費用（ＵＳＢ）：","UX302NC"]
[null,"P00001445","UX302NC-R",null,"0","端末初期費用（ＵＳＢ）：","UX302NC-R"]
[null,"P00001445","MF121/USB(S)",null,0,"端末初期費用（ＵＳＢ）：","MF121"]
[null,"P00001445","WM320/USB(SL)",null,0,"端末初期費用（ＵＳＢ）：","WM320"]
[null,"P00001446","PA-MR05LN",null,"0","端末初期費用（ＷｉＦｉ）：","Aterm MR05LN"]
[null,"P00001446","PA-MR05LN-CLD",null,"0","端末初期費用（ＷｉＦｉ）：","Aterm MR05LN クレードルセット"]
[null,"P00001446","MR04LN/WiFi(SL)",null,0,"端末初期費用（ＷｉＦｉ）：","Aterm MR04LN"]
[null,"P00001446","MR04LN(CDL)/WiFi(SL)",null,0,"端末初期費用（ＷｉＦｉ）：","Aterm MR04LN クレードルセット"]
[null,"P00001446","MR03LN/WiFi(SL)",null,0,"端末初期費用（ＷｉＦｉ）：","Aterm MR03LN"]
[null,"P00001448","A110-AC1AN0-X01",null,0,"端末一括購入代金：","MB-A110 ACアダプタ付#標準保証(1年)"]
[null,"P00001448","A110-AC1AN0-X02",null,0,"端末一括購入代金：","MB-A110 ACアダプタ付#有償保証(2年)"]
[null,"P00001448","A110-AC1AN0-X03",null,0,"端末一括購入代金：","MB-A110 ACアダプタ付#有償保証(3年)"]
[null,"P00001448","A110-AC1AN0-X05",null,0,"端末一括購入代金：","MB-A110 ACアダプタ付#有償保証(5年)"]
[null,"P00001448","A110-AC1AN0-Y01",null,0,"端末一括購入代金：","MB-A110 ACアダプタ付#有償保証/先出しセンドバック(1年)"]
[null,"P00001448","A110-AC1AN0-Y02",null,0,"端末一括購入代金：","MB-A110 ACアダプタ付#有償保証/先出しセンドバック(2年)"]
[null,"P00001448","A110-AC1AN0-Y03",null,0,"端末一括購入代金：","MB-A110 ACアダプタ付#有償保証/先出しセンドバック(3年)"]
[null,"P00001448","A110-AC1AN0-Y05",null,0,"端末一括購入代金：","MB-A110 ACアダプタ付#有償保証/先出しセンドバック(5年)"]
[null,"P00001448","A100-AC1AN0-X01",null,0,"端末一括購入代金：","MB-A100 ACアダプタ付#標準保証(1年)"]
[null,"P00001448","A100-AC1AN0-X02",null,0,"端末一括購入代金：","MB-A100 ACアダプタ付#有償保証(2年)"]
[null,"P00001448","A100-AC1AN0-X03",null,0,"端末一括購入代金：","MB-A100 ACアダプタ付#有償保証(3年)"]
[null,"P00001448","A100-AC1AN0-X05",null,0,"端末一括購入代金：","MB-A100 ACアダプタ付#有償保証(5年)"]
[null,"P00001448","A100-AC1AN0-Y01",null,0,"端末一括購入代金：","MB-A100 ACアダプタ付#有償保証/先出しセンドバック(1年)"]
[null,"P00001448","A100-AC1AN0-Y02",null,0,"端末一括購入代金：","MB-A100 ACアダプタ付#有償保証/先出しセンドバック(2年)"]
[null,"P00001448","A100-AC1AN0-Y03",null,0,"端末一括購入代金：","MB-A100 ACアダプタ付#有償保証/先出しセンドバック(3年)"]
[null,"P00001448","A100-AC1AN0-Y05",null,0,"端末一括購入代金：","MB-A100 ACアダプタ付#有償保証/先出しセンドバック(5年)"]
[null,"P00001448","A110-AC1AN1-X01",null,0,"端末一括購入代金：","MB-A110 ACアダプタ付/外部アンテナ1本#標準保証(1年)"]
[null,"P00001448","A110-AC1AN2-X02",null,0,"端末一括購入代金：","MB-A110 ACアダプタ付/外部アンテナ2本#有償保証(2年)"]
[null,"P00001448","A110-AC1AN2-X03",null,0,"端末一括購入代金：","MB-A110 ACアダプタ付/外部アンテナ2本#有償保証(3年)"]
[null,"P00001448","A110-AC1AN1-X05",null,0,"端末一括購入代金：","MB-A110 ACアダプタ付/外部アンテナ1本#有償保証(5年)"]
{"$rows_left_out":275}
{"sheet":"リスト","index":7,"n_rows":7,"n_cols":2,"rows_kept":7,"cut":false,"hidden":true,"merged":[]}
["IPアドレス帯","NAT後アドレス照合"]
["5台(/29)",{"$f":"IF(初期設定・企業識別子追加!AD57=\"\",\"対象外\",IF(\"/\"&初期設定・企業識別子追加!AD57=MID(初期設定・企業識別子追加!K45,FIND(\"/\",初期設定・企業識別子追加!K45),3),\"ok\",\"ng\"))","v":"対象外"}]
["13台(/28)"]
["29台(/27)"]
["61台(/26)"]
["125台(/25)"]
["253台(/24)"]

{"sheet":"ご提供条件説明","index":8,"n_rows":86,"n_cols":15,"rows_kept":86,"cut":false,"hidden":false,"merged":[[2,2,2,14]]}
[]
[]
[null,null,"Master'sONEモバイルスタンダードタイプ\n(旧称：モバイルM2M VPNタイプ) のご提供条件について"]
[]
[]
[null,null,"本書はご提供条件のうち、特に重要な事項、及びご利用上の注意事項をご案内しております。"]
[null,null,"内容をご一読の上、お申し込みください。"]
[null,null,"また、本ご提供条件はお客さまが弊社の提供するカスタマーコンソールからお申込みになる全てのSIM・端末およびオプションサービスに適用されます。"]
[]
[null,null,"＜サービス内容＞"]
[null,null,"マシンによるデータ収集のご利用を前提としたモバイルデータ通信サービスです。"]
[null,null,"「SIM 単体」、もしくは「SIM 挿入済みの通信端末」をNTTPC よりご提供します。"]
[]
[null,null,"●サービスタイプ"]
[null,null,"　(1) スタンダードタイプ"]
[null,null,"　　　接続先ネットワークをMaster's ONE IP-VPN とする閉域型モバイルアクセス。"]
[]
[null,null,"●モバイル回線"]
[null,null,"　(1) 3Gプラン"]
[null,null,"　　　3G規格に準じたSIMと通信端末をご提供し、NTTドコモのFOMA®エリアにてご利用頂けます。"]
[null,null,"　　　FOMA®プラスエリアのご利用可否については、通信端末の仕様に準じます。"]
[null,null,"　(2) LTEプラン"]
[null,null,"　　　LTE／3Gの両規格に準じたSIMと通信端末をご提供し、NTTドコモのXi®／FOMA®両エリアにてご利用頂けます。"]
[null,null,"　　　Xi®⇔FOMA®間の切り替え動作、及びFOMA®プラスエリアのご利用可否については、通信端末の仕様に準じます。"]
[null,null,"　　　尚、LTEプランでご提供するSIMは、3G専用端末ではご使用頂けません。3Gプランをご選択ください。"]
[]
[null,null,"● SIM のご提供について"]
[null,null,"　・SIM ロックなどモバイル端末の仕様によりご使用頂けない場合があります。"]
[null,null,"　・ご利用予定端末に関する国内認証機関の承認情報をご提出頂く場合があります。"]
[]
{"$rows_left_out":57}
{"sheet":"通信機器売買契約条項","index":9,"n_rows":89,"n_cols":2,"rows_kept":89,"cut":false,"hidden":false,"merged":[[35,18,35,21],[35,22,35,25],[35,12,35,14],[35,15,35,17]]}
[]
[null,"Master'sONE 通信機器売買契約条項"]
[]
[null,"本サービスは、株式会社エヌ・ティ・ティピー・シーコミュニケーションズ（以下、「当社」"]
[null,"といいます。）が当社のMaster’sONE 利用規約（以下、「利用規約」といいます。）に規"]
[null,"定しているMaster'sONEモバイルスタンダードタイプ(旧称：モバイルM2M VPNタイプ)"]
[null,"（以下「対象サービス」といいます。）の契約者に対し、対象サービスで利用できる通信機器"]
[null,"（以下、「対象機器」といいます。）を販売します。"]
[]
[null,"第 1  条 （対象機器の購入にあたって）"]
[null,"対象サービスのお申込をされる方で、対象機器の購入を希望される方（以下、「利用者」と"]
[null,"いいます。）は、本条項を必ずお読みのうえ、対象機器の購入をお申込みいただきます。"]
[]
[null,"第 2  条 （対象機器の購入契約の成立）"]
[null,"1. 利用者は、対象機器の購入を希望する場合、当社指定の方法に従って 対象機器の購入申"]
[null,"込を行うものとします。"]
[null,"2. 利用者と当社との間の 対象機器に関する売買契約（以下「売買契約」という）は、前項"]
[null,"に基づく購入申込を当社が受け付け、これを承諾した時点で成立するものとします。かか"]
[null,"る承諾は、当社所定の方法で利用者へ通知することにより行われます。"]
[null,"3. 対象機器について当社が購入数量等を制限している場合、利用者は、その数量の範囲内"]
[null,"で購入申込を行うことができるものとします。"]
[]
[null,"第 3  条 （申込の拒絶）"]
[null,"1. 当社は、利用者が次の各号のいずれかに該当する場合、対象機器の購入申込を承諾しな"]
[null,"い場合があります。"]
[null,"(1) 申込情報に虚偽の情報があった場合"]
[null,"(2) 料金の滞納等がある場合"]
[null,"(3) 日本国外からの申込又は配送先が日本国外の場合"]
[null,"(4) 当社が購入数量等を制限している場合にその制限を超えた場合"]
[null,"(5)その他当社が申込を承諾することにつき不適当と判断した場合"]
{"$rows_left_out":60}
{"sheet":"Validation","index":10,"n_rows":57,"n_cols":6,"rows_kept":57,"cut":false,"hidden":true,"merged":[]}
["〇バリデーション"]
["大項番","入力項目","小項番","バリデーション内容","警告表示","備考"]
[1,"お申込日",1,"未記入がある","記入してください"]
[null,null,2,"半角数字以外がある","西暦は4桁で記入してください"]
[null,null,3,"西暦が4桁でない","半角数字で記入してください"]
[null,null,4,"正しい日付ではない","正しい日付を記入してください"]
[2,"システム番号",1,"未記入／未選択がある","記入してください"]
[null,null,2,"半角数字1文字以外がある","半角数字１桁ずつ記入してください"]
[3,"申込区分",1,"未選択または複数選択がある","どちらか１つを選択してください"]
[4,"IDタイプ",1,"未選択または複数選択がある","どちらか１つを選択してください"]
[5,"会社名",1,"未記入がある","記入してください"]
[null,null,2,"全角1～40文字以内でない","全角40文字以内で記入してください"]
[6,"担当者名",1,"未記入がある","記入してください"]
[null,null,2,"全角1～50文字以内でない","全角50文字以内で記入してください"]
[7,"電話番号",1,"未記入がある","記入してください"]
[null,null,2,"半角以外がある","半角で記入してください"]
[null,null,3,"電話番号形式でない","電話番号の形式で記入してください","0X-X-Xは12桁か13桁、0XXXは10桁か11桁"]
[8,"メールアドレス",1,"未記入がある","記入してください"]
[null,null,2,"半角以外がある","半角で記入してください"]
[null,null,3,"メールアドレス形式でない","メールアドレスの形式で記入してください","X@X.X"]
[null,null,4,"半角128文字以内でない","メールアドレスの形式で記入してください"]
[9,"システム名",1,"未記入がある","記入してください"]
[null,null,2,"全角1～32文字以内でない","全角50文字以内で記入してください"]
[10,"企業識別子",1,"未記入がある","記入してください"]
[null,null,2,"半角2～13文字以内でない","企業識別子の形式で記入してください"]
[null,null,3,"文字種が「a-zA-Z0-9-_」以外がある","企業識別子の形式で記入してください"]
[null,null,4,"文字種が「0-9-_」のみ","企業識別子の形式で記入してください"]
[11,"設定完了希望日",1,"未記入がある","記入してください"]
[null,null,2,"半角数字以外がある","西暦は4桁で記入してください"]
[null,null,3,"西暦が4桁でない","半角数字で記入してください"]
{"$rows_left_out":27}