{"text_format":"1","workbook":"xlsx","n_sheets":12,"sheets":["初期設定・企業識別子追加","記入例_初期設定・企業識別子追加","(カード型)マルチキャリア料金表","(チップ型)マルチキャリア料金表","ご利用までの流れ","AtMOSInput(ReadOnly)","AtMOSInputUnitPrice(ReadOnly)","リスト","重要事項説明書","パラメーターシート","通信機器売買契約条項","Validation"],"not_rendered":{"charts":0,"images":13,"macros":1,"external_links":4,"defined_names":11,"comments":1,"pivot_tables":0},"unopened":[],"bounds":{"document_bytes":16777216,"sheet_cells":100000,"rows_first":2000,"rows_last":500,"rows_between":2000,"halvings":0,"cell_chars":16384,"cell_head_chars":4096},"cells_cut":0,"cells_raw":0,"read":"whole","date_system":"1900"}

{"sheet":"初期設定・企業識別子追加","index":0,"n_rows":85,"n_cols":41,"rows_kept":85,"cut":false,"hidden":false,"merged":[[38,25,38,28],[38,30,38,35],[32,10,32,23],[32,25,32,38],[35,21,35,22],[35,17,35,18],[35,23,35,24],[35,25,35,26],[33,10,34,44],[35,15,35,16],[1,1,1,44],[2,1,2,44],[3,1,3,44],[4,1,4,44],[5,1,5,44],[6,2,6,23],[7,2,7,23],[8,2,8,23],[9,41,9,42],[9,43,9,44],[9,35,9,36],[9,32,9,34],[9,1,9,8],[9,9,9,11],[9,12,9,13],[9,39,9,40],[9,37,9,38],[15,9,15,44],[9,14,9,15],[9,18,9,19],[9,22,9,23],[50,17,50,21],[22,9,27,9],[17,11,17,18],[9,27,9,31],[11,11,11,15],[11,17,11,21],[12,9,12,30],[13,11,13,24],[13,26,13,30],[14,9,14,44],[45,10,45,19],[35,19,35,20],[65,22,65,24],[65,25,65,27],[48,1,52,8],[53,1,71,8],[67,20,67,35],[56,15,56,22],[56,24,56,36],[64,10,64,44],[82,1,82,8],[79,1,79,8],[81,1,81,8],[40,1,47,8],[18,9,18,44],[26,10,26,25],[26,27,26,43],[29,10,29,30],[23,10,23,30],[20,10,20,30],[30,10,30,44],[70,14,70,21],[50,11,50,15],[81,9,81,20],[60,15,60,22],[80,1,80,8],[84,1,84,8],[84,9,84,20],[84,21,84,44],[83,1,83,8],[83,9,83,20],[80,9,80,20],[67,14,67,19],[79,9,79,20],[73,9,73,15],[72,9,72,15],[72,16,72,20],[74,9,74,44],[78,1,78,23],[78,24,78,44],[73,16,73,44]]}
[]
[null,"InfoSphereモバイルマルチキャリアタイプ 申込書 ver1.9"]
[]
[null,"初期設定シート／企業識別子追加シート"]
[]
[]
[null,null,"株式会社NTT PC コミュニケーションズ　御中"]
[null,null,"InfoSphereモバイル利用規約を承諾の上、下記の通り申し込みます。"]
[null,null,"＜太枠の中をご記入願います。また該当する個所の□を塗りつぶして下さい。＞"]
[null,null,null,null,null,null,null,null,null,"お申込日",null,null,20,null,null,null,"年",null,null,null,"月",null,null,null,"日",null,null,"システム番号",null,null,null,null,"選択式"]
[null,null,null,null,null,null,null,null,null,"申込区分"]
[null,null,null,null,null,null,null,null,null,null,"□","新規申し込み",null,null,null,null,"□","企業識別子追加"]
[null,null,null,null,null,null,null,null,null,"カスタマコンソールご利用有無(InfoSphereモバイルスタンダードタイプ含む)"]
[null,null,null,null,null,null,null,null,null,null,"□","利用中",null,null,null,null,null,null,null,null,null,null,null,null,null,"□","未利用"]
[null,null,null,null,null,null,null,null,null,"カスタマーコンソール開通済みのシステム番号で「未利用」を選択してお申込みすると開通できませんのでご注意ください。また、後から複数のカスタマコンソールを1つ統合することはできません。"]
[null,null,null,null,null,null,null,null,null,"既にご利用している方は「利用中」を、初めてお申込みする場合は「未利用」を選択してください。"]
[null,null,null,null,null,null,null,null,null,"IDタイプ"]
[null,null,null,null,null,null,null,null,null,null,"□","共通ID/固定パスワード",null,null,null,null,null,null,null,"□","ユニークID/固定パスワード",null,null,null,null,null,null,null,null,null,null,"□","共通ID/固定パスワード（チップSIM）"]
[null,null,null,null,null,null,null,null,null,"共通IDとは全てのSIMに同じID・パスワードを使って認証する方式です。ユニークIDとはSIM1枚1枚に異なるID・パスワードを使って認証する方式です。"]
[null,null,null,null,null,null,null,null,null,"会社名"]
[]
[]
[null,null,null,null,null,null,null,null,null,"システム管理者情報","担当者名"]
[]
[]
[null,null,null,null,null,null,null,null,null,null,"電話番号",null,null,null,null,null,null,null,null,null,null,null,null,null,null,null,null,"メールアドレス"]
[]
[]
[null,null,null,null,null,null,null,null,null,"システム名"]
[]
[null,null,null,null,null,null,null,null,null,null,"お客様のネットワークを表す名称です。システム番号を発行する際に指定したシステム名をご記入ください。(全角のみ)"]
[null,null,null,null,null,null,null,null,null,"企業識別子"]
[null,null,null,null,null,null,null,null,null,null,null,null,null,null,null,null,null,null,null,null,null,null,null,null,null,"ご指定の企業識別子の場合、ユーザIDに使える文字数は",null,null,null,null,null,null,null,null,null,null,null,null,null,{"$f":"16-VALUE(LEN(K33))","v":16},"文字です"]
[null,null,null,null,null,null,null,null,null,null,"※文字数は2～13文字の範囲でご記入ください。\n※利用可能な文字は「半角の英数字（大文字・小文字の区別あり）」、「-(ハイフン)」、「_(アンダースコア)」です。ただし数字のみ又は記号のみの指定はできません。\n※ご指定の企業識別子が他のお客様と重複する場合は、他の識別子への変更をお願いさせていただくことがあります。\n※ユーザIDは3～14 文字の範囲でカスタマコンソールより指定できます。"]
[]
[null,null,null,null,null,null,null,null,null,"設定完了希望日",null,null,null,null,20,null,null,"年",null,null,null,"月",null,null,null,"日",null,"SIMおよび端末のお申込みは設定完了希望日以降に行えます。"]
[null,null,null,null,null,null,null,null,null,null,"　新規申し込み／企業識別子追加とも7営業日以降での指定をお願いします。"]
[null,null,null,null,null,null,null,null,null,"設定完了通知先",null,null,null,null,null,"□","通知しない",null,null,null,null,"□","通知する（システム管理者と同じ）"]
[null,null,null,null,null,null,null,null,null,null,null,null,null,null,null,null,null,null,null,null,null,"□","通知する（",null,null,null,null,null,null,"＠",null,null,null,null,null,null,"）","通知先メールアドレスを記載してください。"]
[null,null,null,null,null,null,null,null,null,null,"設定が完了したときにご指定のメールアドレスに設定完了通知メールを送付します。"]
{"$rows_left_out":46}
{"sheet":"記入例_初期設定・企業識別子追加","index":1,"n_rows":85,"n_cols":44,"rows_kept":85,"cut":false,"hidden":false,"merged":[[84,21,84,44],[82,1,82,8],[83,1,83,8],[83,9,83,20],[84,1,84,8],[84,9,84,20],[72,16,72,20],[73,9,73,15],[73,16,73,44],[81,1,81,8],[81,9,81,20],[80,1,80,8],[80,9,80,20],[72,9,72,15],[79,1,79,8],[79,9,79,20],[74,9,74,44],[78,1,78,23],[78,24,78,44],[40,1,47,8],[45,10,45,19],[48,1,52,8],[50,11,50,15],[50,17,50,21],[30,10,30,44],[32,10,32,23],[32,25,32,38],[33,10,34,44],[38,30,38,35],[35,25,35,26],[38,25,38,28],[35,15,35,16],[35,17,35,18],[35,19,35,20],[35,21,35,22],[35,23,35,24],[22,9,27,9],[23,10,23,30],[26,10,26,25],[26,27,26,43],[29,10,29,30],[14,9,14,44],[15,9,15,44],[17,11,17,18],[18,9,18,44],[20,10,20,30],[53,1,71,8],[56,15,56,22],[56,24,56,36],[60,15,60,22],[64,10,64,44],[70,14,70,21],[65,22,65,24],[65,25,65,27],[67,14,67,19],[67,20,67,35],[9,43,9,44],[11,11,11,15],[11,17,11,21],[9,39,9,40],[9,41,9,42],[9,27,9,31],[9,32,9,34],[9,35,9,36],[9,37,9,38],[12,9,12,30],[13,11,13,24],[7,2,7,23],[8,2,8,23],[9,9,9,11],[9,12,9,13],[9,14,9,15],[9,18,9,19],[9,22,9,23],[9,1,9,8],[13,26,13,30],[6,2,6,23],[1,1,1,44],[2,1,2,44],[3,1,3,44],[4,1,4,44],[5,1,5,44]]}
[]
[null,"InfoSphereモバイルマルチキャリアタイプ 申込書"]
[]
[null,"初期設定シート／企業識別子追加シート"]
[]
[]
[null,null,"株式会社NTT PC コミュニケーションズ　御中"]
[null,null,"InfoSphereモバイルスタンダードタイプ利用規約を承諾の上、下記の通り申し込みます。"]
[null,null,"＜太枠の中をご記入願います。また該当する個所の□を塗りつぶして下さい。＞"]
[null,"記入してください",null,null,null,null,null,null,null,"お申込日",null,null,20,null,null,null,"年",null,1,null,"月",null,1,null,"日",null,null,"システム番号",null,null,null,null,"one",null,null,0,null,1,null,2,null,3,null,4]
[null,null,null,null,null,null,null,null,null,"申込区分"]
[null,null,null,null,null,null,null,null,null,null,"■","新規申し込み",null,null,null,null,"□","企業識別子追加"]
[null,null,null,null,null,null,null,null,null,"カスタマコンソールご利用有無(InfoSphereモバイルスタンダードタイプ含む)"]
[null,null,null,null,null,null,null,null,null,null,"□","利用中",null,null,null,null,null,null,null,null,null,null,null,null,null,"■","未利用"]
[null,null,null,null,null,null,null,null,null,"カスタマーコンソール開通済みのシステム番号で「未利用」を選択してお申込みすると開通できませんのでご注意ください。また、後から複数のカスタマコンソールを1つ統合することはできません。"]
[null,null,null,null,null,null,null,null,null,"既にご利用している方は「利用中」を、初めてお申込みする場合は「未利用」を選択してください。"]
[null,null,null,null,null,null,null,null,null,"IDタイプ"]
[null,null,null,null,null,null,null,null,null,null,"■","共通ID/固定パスワード",null,null,null,null,null,null,null,"□","ユニークID/固定パスワード"]
[null,null,null,null,null,null,null,null,null,"共通IDとは全てのSIMに同じID・パスワードを使って認証する方式です。ユニークIDとはSIM1枚1枚に異なるID・パスワードを使って認証する方式です。"]
[null,null,null,null,null,null,null,null,null,"会社名"]
[null,null,null,null,null,null,null,null,null,null,"株式会社エヌ・ティ・ティピー・シーコミュニケーションズ"]
[]
[null,null,null,null,null,null,null,null,null,"システム管理者情報","担当者名"]
[null,null,null,null,null,null,null,null,null,null,"PC次郎"]
[]
[null,null,null,null,null,null,null,null,null,null,"電話番号",null,null,null,null,null,null,null,null,null,null,null,null,null,null,null,null,"メールアドレス"]
[null,null,null,null,null,null,null,null,null,null,"00-0000-0000",null,null,null,null,null,null,null,null,null,null,null,null,null,null,null,null,"pctaro@nttpc.co.jp"]
[]
[null,null,null,null,null,null,null,null,null,"システム名"]
[null,null,null,null,null,null,null,null,null,null," Ｍ２ＭＩ＿ＮＴＴＰＣ＿Ｍ２Ｍネットワーク"]
[null,null,null,null,null,null,null,null,null,null,"お客様のネットワークを表す名称です。システム番号を発行する際に指定したシステム名をご記入ください。(全角のみ)"]
[null,null,null,null,null,null,null,null,null,"企業識別子"]
[null,null,null,null,null,null,null,null,null,null,"int-m2m",null,null,null,null,null,null,null,null,null,null,null,null,null,null,"ご指定の企業識別子の場合、ユーザIDに使える文字数は",null,null,null,null,null,null,null,null,null,null,null,null,null,{"$f":"16-VALUE(LEN(K33))","v":9},"文字です"]
[null,null,null,null,null,null,null,null,null,null,"※文字数は2～13文字の範囲でご記入ください。\n※利用可能な文字は「半角の英数字（大文字・小文字の区別あり）」、「-(ハイフン)」、「_(アンダースコア)」です。ただし数字のみ又は記号のみの指定はできません。\n※ご指定の企業識別子が他のお客様と重複する場合は、他の識別子への変更をお願いさせていただくことがあります。\n※ユーザIDは3～14 文字の範囲でカスタマコンソールより指定できます。"]
[]
[null,null,null,null,null,null,null,null,null,"設定完了希望日",null,null,null,null,20,21,null,"年",null,1,null,"月",null,31,null,"日",null,"SIMおよび端末のお申込みは設定完了希望日以降に行えます。"]
[null,null,null,null,null,null,null,null,null,null,"　新規申し込み／企業識別子追加とも5営業日以降での指定をお願いします。"]
[null,null,null,null,null,null,null,null,null,"設定完了通知先",null,null,null,null,null,"□","通知しない",null,null,null,null,"■","通知する（システム管理者と同じ）"]
[null,null,null,null,null,null,null,null,null,null,null,null,null,null,null,null,null,null,null,null,null,"□","通知する（",null,null,null,null,null,null,"＠",null,null,null,null,null,null,"）","通知先メールアドレスを記載してください。"]
[null,null,null,null,null,null,null,null,null,null,"設定が完了したときにご指定のメールアドレスに設定完了通知メールを送付します。"]
{"$rows_left_out":46}
{"sheet":"(カード型)マルチキャリア料金表","index":2,"n_rows":34,"n_cols":4,"rows_kept":34,"cut":false,"hidden":false,"merged":[]}
["料金表"]
[]
["InfoSphereモバイルマルチキャリアタイプのお申込みにあたり、弊社が提供する"]
["カスタマーコンソールから発注されたSIMおよび端末は下記に規定する提供料金が適用されます。"]
["下記に規定する料金に記載のない項目については、利用規約および当該見積書/契約書等が適用されます。"]
[]
[]
["InfoSphereモバイル利用規約：https://www.nttpc.co.jp/support/term/infosphere.html"]
[]
["下記料金表は消費税及び地方消費税相当額を含まない金額を表示します。"]
[]
["■InfoSphereモバイル　マルチキャリアタイプ基本サービス初期料金"]
["項目","金額(税抜)","金額(税込)","対象"]
["事務手数料",1980,{"$f":"B14*1.1","v":2178},"1回線毎"]
["SIM発行手数料",394,{"$f":"B15*1.1","v":433.40000000000003},"1回線毎"]
["配送料",990,1089,"1申し込み毎"]
[]
["■InfoSphereモバイルマルチキャリアタイプ基本サービス月額料金（1回線毎)"]
["プラン","金額(税抜)","金額(税込)","対応回線"]
["従量プラン",180,{"$f":"B20*1.1","v":198.00000000000003},"国際ローミング"]
[]
["■InfoSphereモバイルマルチキャリアタイプ通信料金（1利用回線毎)"]
["グループ","金額(税抜)","金額(税込)/海外は非課税","単位"]
["国内グループ",5,{"$f":"B24*1.1","v":5.5},"1MBあたり"]
["海外グループ1",5,{"$f":"B25","v":5},"1MBあたり"]
["海外グループ2",8,{"$f":"B26","v":8},"1MBあたり"]
["海外グループ3",10,10,"1MBあたり"]
["海外グループ4",13,13,"1MBあたり"]
["海外グループ5",20,20,"1MBあたり"]
["海外グループ6",38,38,"1MBあたり"]
[]
["■InfoSphereモバイルマルチキャリアタイプオプション料金"]
[null,"金額(税抜)","金額(税込)","対象"]
["グローバルIPアドレス",500,{"$f":"B34*1.1","v":550},"1回線毎"]

{"sheet":"(チップ型)マルチキャリア料金表","index":3,"n_rows":35,"n_cols":4,"rows_kept":35,"cut":false,"hidden":true,"merged":[]}
["料金表"]
[]
["InfoSphereモバイルマルチキャリアタイプのお申込みにあたり、弊社が提供する"]
["カスタマーコンソールから発注されたSIMおよび端末は下記に規定する提供料金が適用されます。"]
["下記に規定する料金に記載のない項目については、利用規約および当該見積書/契約書等が適用されます。"]
[]
[]
["InfoSphereモバイル利用規約：https://www.nttpc.co.jp/support/term/infosphere.html"]
[]
["下記料金表は消費税及び地方消費税相当額を含まない金額を表示します。"]
[]
["■InfoSphereモバイル　マルチキャリアタイプ基本サービス初期料金"]
["項目","金額(税抜)","金額(税込)","対象"]
["事務手数料",1980,{"$f":"B14*1.1","v":2178},"1回線毎"]
["SIM発行手数料",394,{"$f":"B15*1.1","v":433.40000000000003},"1回線毎"]
["配送料",990,1089,"1申し込み毎"]
["初期料金はチップSIM納品時に請求いたします。"]
[]
["■InfoSphereモバイルマルチキャリアタイプ基本サービス月額料金（1回線毎)"]
["プラン","金額(税抜)","金額(税込)","対応回線"]
["従量プラン",180,{"$f":"B21*1.1","v":198.00000000000003},"国際ローミング"]
[]
["■InfoSphereモバイルマルチキャリアタイプ通信料金（1利用回線毎)"]
["グループ","金額(税抜)","金額(税込)/海外は非課税","単位"]
["国内グループ",5,{"$f":"B25*1.1","v":5.5},"1MBあたり"]
["海外グループ1",5,{"$f":"B26","v":5},"1MBあたり"]
["海外グループ2",8,{"$f":"B27","v":8},"1MBあたり"]
["海外グループ3",10,10,"1MBあたり"]
["海外グループ4",13,13,"1MBあたり"]
["海外グループ5",20,20,"1MBあたり"]
["海外グループ6",38,38,"1MBあたり"]
[]
["■InfoSphereモバイルマルチキャリアタイプオプション料金"]
[null,"金額(税抜)","金額(税込)","対象"]
["グローバルIPアドレス",500,{"$f":"B35*1.1","v":550},"1回線毎"]

{"sheet":"ご利用までの流れ","index":4,"n_rows":0,"n_cols":0,"rows_kept":0,"cut":false,"hidden":false,"merged":[]}

{"sheet":"AtMOSInput(ReadOnly)","index":5,"n_rows":51,"n_cols":4,"rows_kept":51,"cut":false,"hidden":true,"merged":[]}
["AtMOS項目名","AtMOS入力値","型","AtMOSコード"]
["申込日",{"$f":"IF(AND(初期設定・企業識別子追加!O10=\"\",初期設定・企業識別子追加!S10=\"\",初期設定・企業識別子追加!W10=\"\"),\"\",初期設定・企業識別子追加!M10&初期設定・企業識別子追加!O10&\"/\"&初期設定・企業識別子追加!S10&\"/\"&初期設定・企業識別子追加!W10)","v":""},"日付"]
["システム番号",{"$f":"初期設定・企業識別子追加!AG10 & 初期設定・企業識別子追加!AJ10 & 初期設定・企業識別子追加!AL10 & 初期設定・企業識別子追加!AN10 & 初期設定・企業識別子追加!AP10 & 初期設定・企業識別子追加!AR10","v":"選択式"},"文字列"]
["システム名",{"$f":"IF(初期設定・企業識別子追加!K30=\"\",\"\",初期設定・企業識別子追加!K30)","v":""},"文字列"]
["ネットワーク種別",2,"コード：ネットワーク種別","1:VPNタイプ\n2:インターネットタイプ"]
["端末IPアドレス帯",{"$f":"IF(初期設定・企業識別子追加!K43=\"■\",\"5\",IF(初期設定・企業識別子追加!X43=\"■\",\"1\",\"\"))","v":""},"コード：クラス","1:グローバルアドレス\n2:シェアードアドレス\n3:プライベートアドレス(クラスA)\n4:プライベートアドレス(クラスB)\n5:標準サービス（プライベートIP固定）"]
["サフィックス",{"$f":"B8&\".\" & B9& \".\" &B10","v":"..sphere.jp"},"文字列"]
["【サフィックス】企業識別子",{"$f":"IF(初期設定・企業識別子追加!K33=\"\",\"\",初期設定・企業識別子追加!K33)","v":""},"文字列"]
["【サフィックス】サービス識別子",{"$f":"IF(AND(B12=4,B11=2),\"icm\",IF(AND(B12=4,B11=1),\"ium\",IF(AND(B12=6,B11=2),\"cib\",\"\")))","v":""},"文字列"]
["【サフィックス】ドメイン","sphere.jp","文字列"]
["認証方式",{"$f":"IF(AND(初期設定・企業識別子追加!K18=\"□\",初期設定・企業識別子追加!T18=\"□\",初期設定・企業識別子追加!AF18=\"□\"),\"\",IF(初期設定・企業識別子追加!T18=\"■\",1,2))","v":""},"コード：アカウントタイプ","1:ユニークID\n2:共通ID"]
["【通信方式】通信規格",{"$f":"IF(OR(初期設定・企業識別子追加!K18=\"■\",初期設定・企業識別子追加!T18=\"■\"),4,IF(初期設定・企業識別子追加!AF18=\"■\",6,\"\"))","v":""},"コード：通信規格","1:3G\n2:LTE\n3:バックアップ\n4:マルチキャリア\n5:チップSIMスタンダード\n6:チップSIMマルチキャリア"]
["【通信方式】PDPタイプ",2,"コード：PDPタイプ","1:PPP\n2:IP"]
["IPアドレス数",{"$f":"IFERROR(MID(初期設定・企業識別子追加!K46,FIND(\"/\",初期設定・企業識別子追加!K46),3),\"\")","v":""},"文字列"]
["【NAT機能】NAT機能有無",null,"コード：NAT利用","0:利用しない\n1:利用する"]
["【NAT機能】NAT後アドレス帯",null,"文字列"]
["【NAT機能】NAT後IPアドレス数",null,"文字列"]
["【NAT機能】NAT後試験アドレス",null,"文字列"]
["折り返し通信禁止",null,"コード：折り返し通信禁止有無","0:利用しない\n1:利用する"]
["【SIM管理API】SIM管理API有無",{"$f":"IF(AND(初期設定・企業識別子追加!K12=\"■\",初期設定・企業識別子追加!Z14=\"■\"),0,\"\")","v":""},"コード：SIM管理API利用","0:利用しない\n1:利用する"]
["【SIM管理API】ユーザID",null,"文字列"]
["【SIM管理API】パスワード",null,"文字列"]
["【DNSアドレス付与】DNSアドレス付与有無",null,"コード：DNSアドレス付与","0:利用しない\n1:利用する"]
["【DNSアドレス付与】プライマリDNS",null,"文字列"]
["【DNSアドレス付与】セカンダリDNS",null,"文字列"]
["【カスタマコントロール利用管理者】ユーザID",{"$f":"IF(B20=0,初期設定・企業識別子追加!P57&\"@\"&初期設定・企業識別子追加!Y57,\"\")","v":""},"文字列"]
["【カスタマコントロール利用管理者】パスワード",{"$f":"IF(B20=0,初期設定・企業識別子追加!P61,\"\")","v":""},"文字列"]
["最低利用期間",{"$f":"IF(初期設定・企業識別子追加!J80=\"\",\"\",初期設定・企業識別子追加!J80)","v":0},"数値（月数）"]
["利用開始希望日",{"$f":"IF(AND(初期設定・企業識別子追加!P36=\"\",  初期設定・企業識別子追加!T36=\"\", 初期設定・企業識別子追加!X36=\"\"),\"\",  初期設定・企業識別子追加!O36 &初期設定・企業識別子追加!P36& \"/\" & 初期設定・企業識別子追加!T36 & \"/\" & 初期設定・企業識別子追加!X36)","v":""},"日付"]
["契約番号",{"$f":"IF(初期設定・企業識別子追加!J82=\"\",\"\",初期設定・企業識別子追加!J82)","v":""},"文字列"]
["OEM・代理店識別番号",{"$f":"IF(NOT(AND(初期設定・企業識別子追加!K12=\"■\",初期設定・企業識別子追加!Z14=\"■\")),\"\",IF(初期設定・企業識別子追加!J81=\"\",\"\",初期設定・企業識別子追加!J81))","v":""},"文字列"]
["未使用"]
["未使用"]
["未使用"]
["未使用"]
["未使用"]
["未使用"]
["未使用"]
["設定完了通知先アドレス(ユーザ)",{"$f":"IF(OR(AND(初期設定・企業識別子追加!P38=\"□\",初期設定・企業識別子追加!V38=\"□\",初期設定・企業識別子追加!V39=\"□\"),初期設定・企業識別子追加!P38=\"■\"),\"\",IF(初期設定・企業識別子追加!V38=\"■\",初期設定・企業識別子追加!AB27,初期設定・企業識別子追加!Z39&\"@\"&初期設定・企業識別子追加!AE39))","v":""},"文字列"]
["設定完了通知先アドレス(営業/OEM)",{"$f":"IF(初期設定・企業識別子追加!J84=\"\",\"\",初期設定・企業識別子追加!J84)","v":""}]
{"$rows_left_out":12}
{"sheet":"AtMOSInputUnitPrice(ReadOnly)","index":6,"n_rows":304,"n_cols":8,"rows_kept":304,"cut":false,"hidden":true,"merged":[]}
["適用開始年月","明細内訳コード","型番","端末機種コード","金額","請求明細名","端末名称（レンタル・物販の場合）","備考"]
[null,"P00001445","UX302NC",null,0,"端末初期費用（ＵＳＢ）：","UX302NC"]
[null,"P00001445","UX302NC-R",null,"0","端末初期費用（ＵＳＢ）：","UX302NC-R"]
[null,"P00001445","MF121/USB(S)",null,0,"端末初期費用（ＵＳＢ）：","MF121"]
[null,"P00001445","WM320/USB(SL)",null,0,"端末初期費用（ＵＳＢ）：","WM320"]
[null,"P00001446","PA-MR05LN",null,"0","端末初期費用（ＷｉＦｉ）：","Aterm MR05LN"]
[null,"P00001446","PA-MR05LN-CLD",null,"0","端末初期費用（ＷｉＦｉ）：","Aterm MR05LN クレードルセット"]
[null,"P00001446","MR04LN/WiFi(SL)",null,0,"端末初期費用（ＷｉＦｉ）：","Aterm MR04LN"]
[null,"P00001446","MR04LN(CDL)/WiFi(SL)",null,0,"端末初期費用（ＷｉＦｉ）：","Aterm MR04LN クレードルセット"]
[null,"P00001446","MR03LN/WiFi(SL)",null,0,"端末初期費用（ＷｉＦｉ）：","Aterm MR03LN"]
[null,"P00001448","A110-AC1AN0-X01",null,0,"端末一括購入代金：","MB-A110 ACアダプタ付#標準保証(1年)"]
[null,"P00001448","A110-AC1AN0-X02",null,0,"端末一括購入代金：","MB-A110 ACアダプタ付#有償保証(2年)"]
[null,"P00001448","A110-AC1AN0-X03",null,0,"端末一括購入代金：","MB-A110 ACアダプタ付#有償保証(3年)"]
[null,"P00001448","A110-AC1AN0-X05",null,0,"端末一括購入代金：","MB-A110 ACアダプタ付#有償保証(5年)"]
[null,"P00001448","A110-AC1AN0-Y01",null,0,"端末一括購入代金：","MB-A110 ACアダプタ付#有償保証/先出しセンドバック(1年)"]
[null,"P00001448","A110-AC1AN0-Y02",null,0,"端末一括購入代金：","MB-A110 ACアダプタ付#有償保証/先出しセンドバック(2年)"]
[null,"P00001448","A110-AC1AN0-Y03",null,0,"端末一括購入代金：","MB-A110 ACアダプタ付#有償保証/先出しセンドバック(3年)"]
[null,"P00001448","A110-AC1AN0-Y05",null,0,"端末一括購入代金：","MB-A110 ACアダプタ付#有償保証/先出しセンドバック(5年)"]
[null,"P00001448","A100-AC1AN0-X01",null,0,"端末一括購入代金：","MB-A100 ACアダプタ付#標準保証(1年)"]
[null,"P00001448","A100-AC1AN0-X02",null,0,"端末一括購入代金：","MB-A100 ACアダプタ付#有償保証(2年)"]
[null,"P00001448","A100-AC1AN0-X03",null,0,"端末一括購入代金：","MB-A100 ACアダプタ付#有償保証(3年)"]
[null,"P00001448","A100-AC1AN0-X05",null,0,"端末一括購入代金：","MB-A100 ACアダプタ付#有償保証(5年)"]
[null,"P00001448","A100-AC1AN0-Y01",null,0,"端末一括購入代金：","MB-A100 ACアダプタ付#有償保証/先出しセンドバック(1年)"]
[null,"P00001448","A100-AC1AN0-Y02",null,0,"端末一括購入代金：","MB-A100 ACアダプタ付#有償保証/先出しセンドバック(2年)"]
[null,"P00001448","A100-AC1AN0-Y03",null,0,"端末一括購入代金：","MB-A100 ACアダプタ付#有償保証/先出しセンドバック(3年)"]
[null,"P00001448","A100-AC1AN0-Y05",null,0,"端末一括購入代金：","MB-A100 ACアダプタ付#有償保証/先出しセンドバック(5年)"]
[null,"P00001448","A110-AC1AN1-X01",null,0,"端末一括購入代金：","MB-A110 ACアダプタ付/外部アンテナ1本#標準保証(1年)"]
[null,"P00001448","A110-AC1AN2-X02",null,0,"端末一括購入代金：","MB-A110 ACアダプタ付/外部アンテナ2本#有償保証(2年)"]
[null,"P00001448","A110-AC1AN2-X03",null,0,"端末一括購入代金：","MB-A110 ACアダプタ付/外部アンテナ2本#有償保証(3年)"]
[null,"P00001448","A110-AC1AN1-X05",null,0,"端末一括購入代金：","MB-A110 ACアダプタ付/外部アンテナ1本#有償保証(5年)"]
[null,"P00001448","A110-AC1AN1-Y01",null,0,"端末一括購入代金：","MB-A110 ACアダプタ付/外部アンテナ1本#有償保証/先出しセンドバック(1年)"]
[null,"P00001448","A110-AC1AN2-Y02",null,0,"端末一括購入代金：","MB-A110 ACアダプタ付/外部アンテナ2本#有償保証/先出しセンドバック(2年)"]
[null,"P00001448","A110-AC1AN2-Y03",null,0,"端末一括購入代金：","MB-A110 ACアダプタ付/外部アンテナ2本#有償保証/先出しセンドバック(3年)"]
[null,"P00001448","A110-AC1AN1-Y05",null,0,"端末一括購入代金：","MB-A110 ACアダプタ付/外部アンテナ1本#有償保証/先出しセンドバック(5年)"]
[null,"P00001448","A100-AC1AN1-X01",null,0,"端末一括購入代金：","MB-A100 ACアダプタ付/外部アンテナ1本#標準保証(1年)"]
[null,"P00001448","A100-AC1AN2-X02",null,0,"端末一括購入代金：","MB-A100 ACアダプタ付/外部アンテナ2本#有償保証(2年)"]
[null,"P00001448","A100-AC1AN2-X03",null,0,"端末一括購入代金：","MB-A100 ACアダプタ付/外部アンテナ2本#有償保証(3年)"]
[null,"P00001448","A100-AC1AN1-X05",null,0,"端末一括購入代金：","MB-A100 ACアダプタ付/外部アンテナ1本#有償保証(5年)"]
[null,"P00001448","A100-AC1AN1-Y01",null,0,"端末一括購入代金：","MB-A100 ACアダプタ付/外部アンテナ1本#有償保証/先出しセンドバック(1年)"]
[null,"P00001448","A100-AC1AN2-Y02",null,0,"端末一括購入代金：","MB-A100 ACアダプタ付/外部アンテナ2本#有償保証/先出しセンドバック(2年)"]
{"$rows_left_out":265}
{"sheet":"リスト","index":7,"n_rows":7,"n_cols":1,"rows_kept":7,"cut":false,"hidden":true,"merged":[]}
["IPアドレス帯"]
["5台(/29)"]
["13台(/28)"]
["29台(/27)"]
["61台(/26)"]
["125台(/25)"]
["253台(/24)"]

{"sheet":"重要事項説明書","index":8,"n_rows":265,"n_cols":23,"rows_kept":265,"cut":false,"hidden":false,"merged":[[252,16,254,16],[257,5,258,5],[257,6,258,6],[257,15,258,15],[257,16,258,16],[251,4,255,4],[251,14,255,14],[252,5,254,5],[252,6,254,6],[252,15,254,15],[221,16,223,16],[238,10,239,10],[241,4,242,4],[241,14,242,14],[243,4,250,4],[243,14,250,14],[245,5,248,5],[245,6,248,6],[245,15,248,15],[245,16,248,16],[220,4,223,4],[220,14,223,14],[221,5,223,5],[221,6,223,6],[221,15,223,15],[208,15,211,15],[208,16,211,16],[214,4,219,4],[214,14,219,14],[215,5,216,5],[215,6,216,6],[215,15,216,15],[215,16,216,16],[202,10,203,10],[205,4,206,4],[205,14,206,14],[207,4,213,4],[207,14,213,14],[208,5,211,5],[208,6,211,6],[176,16,179,16],[183,4,186,4],[183,14,186,14],[184,5,186,5],[184,6,186,6],[184,15,186,15],[184,16,186,16],[174,4,182,4],[174,14,182,14],[176,5,179,5],[176,6,179,6],[176,15,179,15],[152,15,156,15],[152,16,156,16],[169,10,170,10],[172,4,173,4],[172,14,173,14],[2,2,2,14],[125,3,128,3],[145,4,150,4],[145,14,150,14],[151,4,156,4],[151,14,156,14],[152,5,156,5],[152,6,156,6]]}
[]
[]
[null,null,"InfoSphereモバイルマルチキャリアタイプ重要事項説明書"]
[]
[]
[null,null,"本書はご提供条件のうち、特に重要な事項、及びご利用上の注意事項をご案内しております。"]
[null,null,"内容をご一読の上、お申し込みください。"]
[null,null,"また、本ご提供条件はお客さまが弊社の提供するカスタマーコンソールからお申込みになる全てのSIM・端末およびオプションサービスに適用されます。"]
[]
[null,null,"＜サービス内容＞"]
[null,null,"IoT用途でのご利用を前提とした国際ローミングSIMを利用したモバイルデータ通信サービスです。"]
[null,null,"「SIM 単体」をNTTPC よりご提供します。"]
[]
[null,null,"●サービスタイプ"]
[null,null,"　(1) マルチキャリアタイプ"]
[null,null,"　　　国際ローミングSIMを利用し、接続先ネットワークをMaster's ONE IP-VPN とする閉域型モバイルアクセス。"]
[]
[null,null,"●モバイル回線"]
[null,null,"　　国際ローミングSIMに対応した端末で利用でき、提携する国際ローミング事業者が提供可能なエリアに準じてご利用いただけます。"]
[null,null,"　　利用可能エリアご案内URL:"]
[]
[null,null,"● SIM のご提供について"]
[null,null,"　・ご利用予定端末に関する国内認証機関の承認情報をご提出頂く場合があります。"]
[]
[null,null,"<端末アドレスについて>"]
[null,null,"予約された端末アドレスが長期間払い出されない場合は、予約済みIPアドレスの数またはIPアドレスそのものを変更する場合があります。"]
[]
[null,null,"＜通信速度、通信遅延について＞"]
[null,null,"通信速度、通信遅延はベストエフォートです。日本国内での利用を含め、お客様のご利用される国、エリア、利用環境、回線の混雑状況、"]
[null,null,"ご利用時間帯によっては大幅に低下することがあります。"]
[]
[null,null,"＜故障対応について＞"]
[null,null,"回線の故障復旧対応は、国際ローミング事業者の提供条件(原則、現地平日9時～17時)に則ります。また国際ローミング事業者や"]
[null,null,"国内・海外キャリア(MNO)の故障対応状況により、回線の復旧対応に時間を要する場合があります。"]
[]
[null,null,"＜サービス提供エリアと価格の変更について＞"]
[null,null,"本サービスのサービス提供エリア(国・地域)は国際ローミング事業者の提供エリア(国・地域)の変更に伴い、"]
[null,null,"提供する国・地域を削除もしくは追加し、価格を変更することがあります。"]
[null,null,"サービスエリアの変更もしくは価格を変更する場合には、1ヶ月前を目途としてお客様に通知します。"]
[]
{"$rows_left_out":226}
{"sheet":"パラメーターシート","index":9,"n_rows":0,"n_cols":0,"rows_kept":0,"cut":false,"hidden":false,"merged":[]}

{"sheet":"通信機器売買契約条項","index":10,"n_rows":88,"n_cols":2,"rows_kept":88,"cut":false,"hidden":true,"merged":[[35,12,35,14],[35,15,35,17],[35,18,35,21],[35,22,35,25]]}
[]
[null,"InfoSphereモバイルスタンダードタイプ 通信機器売買契約条項"]
[]
[null,"本サービスは、株式会社エヌ・ティ・ティピー・シーコミュニケーションズ（以下、「当社」"]
[null,"といいます。）が当社のInfoSphereモバイルスタンダードタイプ 利用規約（以下、"]
[null,"「利用規約」といいます。）に規定しているサービス（以下「対象サービス」といいます。）"]
[null,"の契約者に対し、対象サービスで利用できる通信機器（以下、「対象機器」といいます。）"]
[null,"を販売します。"]
[]
[null,"第 1  条 （対象機器の購入にあたって）"]
[null,"対象サービスのお申込をされる方で、対象機器の購入を希望される方（以下、「利用者」と"]
[null,"いいます。）は、本条項を必ずお読みのうえ、対象機器の購入をお申込みいただきます。"]
[]
[null,"第 2  条 （対象機器の購入契約の成立）"]
[null,"1. 利用者は、対象機器の購入を希望する場合、当社指定の方法に従って 対象機器の購入申"]
[null,"込を行うものとします。"]
[null,"2. 利用者と当社との間の 対象機器に関する売買契約（以下「売買契約」という）は、前項"]
[null,"に基づく購入申込を当社が受け付け、これを承諾した時点で成立するものとします。かか"]
[null,"る承諾は、当社所定の方法で利用者へ通知することにより行われます。"]
[null,"3. 対象機器について当社が購入数量等を制限している場合、利用者は、その数量の範囲内"]
[null,"で購入申込を行うことができるものとします。"]
[]
[null,"第 3  条 （申込の拒絶）"]
[null,"1. 当社は、利用者が次の各号のいずれかに該当する場合、対象機器の購入申込を承諾しな"]
[null,"い場合があります。"]
[null,"(1) 申込情報に虚偽の情報があった場合"]
[null,"(2) 料金の滞納等がある場合"]
[null,"(3) 日本国外からの申込又は配送先が日本国外の場合"]
[null,"(4) 当社が購入数量等を制限している場合にその制限を超えた場合"]
[null,"(5)その他当社が申込を承諾することにつき不適当と判断した場合"]
[]
[null,"第 4  条 （代金及び支払方法）"]
[null,"1. 対象機器の販売代金（以下「端末代金」という）、その他付帯費用は別途当社が提示する"]
[null,"見積書によるものとします。"]
[null,"2. 利用者は、利用規約にて定める支払条件に従い、端末代金、その他付帯費用を支払うも"]
[null,"のとします。"]
[]
[null,"第 5  条 （配送)"]
[null,"1. 当社は、対象機器を当社の指定する配送業者により配送するものとします。"]
[null,"2. 当社は、売買契約締結後、利用者が当社へ通知した住所へ 対象機器を配送するものとし"]
{"$rows_left_out":49}
{"sheet":"Validation","index":11,"n_rows":65,"n_cols":8,"rows_kept":65,"cut":false,"hidden":true,"merged":[]}
["〇バリデーション"]
["大項番","シート名","中項番","入力項目","小項番","バリデーション内容","警告表示","備考"]
[1,"初期設定・企業識別子追加",1,"お申込日",1,"未記入がある","記入してください"]
[null,null,null,null,2,"半角数字以外がある","半角数字で記入してください"]
[null,null,null,null,3,"西暦が4桁でない","西暦は4桁で記入してください"]
[null,null,null,null,4,"正しい日付ではない","正しい日付を記入してください"]
[null,null,2,"システム番号",1,"未記入／未選択がある","記入してください"]
[null,null,null,null,2,"半角数字1文字以外がある","半角数字１桁ずつ記入してください"]
[null,null,3,"申込区分",1,"未選択または複数選択がある","どちらか１つを選択してください"]
[null,null,4,"カスタマーコンソール利用管理者ご利用有無",1,"未選択または複数選択がある","どちらか１つを選択してください"]
[null,null,5,"IDタイプ",1,"未選択または複数選択がある","どちらか１つを選択してください"]
[null,null,6,"会社名",1,"未記入","記入してください"]
[null,null,null,null,2,"全角1～40文字以内でない","全角40文字以内で記入してください"]
[null,null,7,"担当者名",1,"未記入","記入してください"]
[null,null,null,null,2,"全角1～50文字以内でない","全角50文字以内で記入してください"]
[null,null,8,"電話番号",1,"未記入","記入してください"]
[null,null,null,null,2,"半角以外がある","半角で記入してください"]
[null,null,null,null,3,"電話番号形式でない","電話番号の形式で記入してください","0X-X-Xは12桁か13桁、0XXXは10桁か11桁"]
[null,null,9,"メールアドレス",1,"未記入","記入してください"]
[null,null,null,null,2,"半角以外がある","メールアドレスの形式で記入してください"]
[null,null,null,null,3,"メールアドレス形式でない","メールアドレスの形式で記入してください","X@X.X"]
[null,null,null,null,4,"半角128文字以内でない","メールアドレスの形式で記入してください"]
[null,null,10,"システム名",1,"未記入","記入してください"]
[null,null,null,null,2,"全角1～32文字以内でない","全角50文字以内で記入してください"]
[null,null,11,"企業識別子",1,"未記入","記入してください"]
[null,null,null,null,2,"半角2～13文字以内でない","企業識別子の形式で記入してください"]
[null,null,null,null,3,"文字種が「a-zA-Z0-9-_」以外がある","企業識別子の形式で記入してください"]
[null,null,null,null,4,"文字種が「0-9-_」のみ","企業識別子の形式で記入してください"]
[null,null,12,"設定完了希望日",1,"未記入がある","記入してください"]
[null,null,null,null,2,"半角数字以外がある","半角数字で記入してください"]
[null,null,null,null,3,"西暦が4桁でない","西暦は4桁で記入してください"]
[null,null,null,null,4,"正しい日付ではない","正しい日付を記入してください"]
[null,null,13,"設定完了通知先",1,"未選択または複数選択がある","どちらか１つを選択してください"]
[null,null,null,null,2,"「通知する（その他）」でメールアドレスが未記入","記入してください"]
[null,null,null,null,3,"「通知する（その他）」でメールアドレス形式でない","メールアドレスの形式で記入してください","X@X.X"]
[null,null,null,null,4,"「通知する（その他）」でメールアドレスが半角128文字以内でない","メールアドレスの形式で記入してください"]
[null,null,14,"端末IPアドレス帯",1,"未選択または複数選択がある","どちらか１つを選択してください"]
[null,null,15,"ご利用端末数",1,"未選択","記入してください"]
[null,null,16,"折り返し通信禁止",1,"未選択または複数選択がある","どちらか１つを選択してください"]
[null,null,17,"NAT機能",1,"未選択または複数選択がある","どちらか１つを選択してください"]
{"$rows_left_out":25}